{"text_format":"1","workbook":"xlsx","n_sheets":5,"sheets":["UI","Wartungsplan","Fahrzeugdaten","Servicezeiten","VIN Table"],"not_rendered":{"charts":0,"images":1,"macros":1,"external_links":0,"defined_names":3,"comments":0,"pivot_tables":0},"unopened":[],"bounds":{"document_bytes":16777216,"sheet_cells":100000,"rows_first":2000,"rows_last":500,"rows_between":2000,"halvings":0,"cell_chars":16384,"cell_head_chars":4096},"cells_cut":0,"cells_raw":0,"read":"whole","date_system":"1900"}

{"sheet":"UI","index":0,"n_rows":14,"n_cols":11,"rows_kept":14,"cut":false,"hidden":false,"merged":[[11,8,11,9],[5,8,5,9],[1,8,1,9],[1,1,1,4],[1,5,2,5],[2,1,2,4],[4,1,4,2],[4,3,4,5]]}
[]
[null,{"$f":"IF(J9=\"VIN not found\",J3,J9)","v":"T60 Max"},null,null,null,{"$error":"#VALUE!"},null,null,"Suche ohne VIN\nRecherche sans VIN\nRicerca senza VIN"]
[null,"MAINTENANCE CHECK SHEET ",null,null,null,null,null,null,"Modell"]
[null,null,null,null,null,null,null,null,"Baujahr"]
[null,"Intervall"]
[null,"km","Jahre","Wartungsplan","Arbeitszeit (h) *","Ausgeführt",null,null,"Fahrzeug Daten"]
[null,null,null,null,null,null,null,null,"VIN","LSFAM11C1SA074265","leer lassen bei Suche ohne VIN"]
[null,null,null,null,null,null,null,null,"km-Stand",5002]
[null,null,null,null,null,null,null,null,"Modell",{"$f":"IF(J7=\"\",\"VIN not found\",IF(_xlfn.XLOOKUP(J7,Fahrzeugdaten!A:A,Fahrzeugdaten!K:K,\"VIN not found\")=0,\"\",_xlfn.XLOOKUP(J7,Fahrzeugdaten!A:A,Fahrzeugdaten!K:K,\"VIN not found\")))","v":"T60 Max"}]
[null,null,null,null,null,null,null,null,"Baujahr",{"$f":"IF(J7=\"\",\"VIN not found\",IF(_xlfn.XLOOKUP(J7,Fahrzeugdaten!A:A,Fahrzeugdaten!J:J,\"VIN not found\")=0,\"\",_xlfn.XLOOKUP(J7,Fahrzeugdaten!A:A,Fahrzeugdaten!J:J,\"VIN not found\")))","v":2025}]
[]
[null,null,null,null,null,null,null,null,"Fällige Wartung"]
[null,null,null,null,null,null,null,null,"nach km",{"$f":"IF(J9=\"Deliver 9\",IF($J$8<5001,\"5000km or 6 Months\",\"Standard\"),\"Standard\")","v":"Standard"}]
[null,null,null,null,null,null,null,null,"nach Alter",{"$f":"IFERROR(YEAR(TODAY())-J10,\"\")","v":1}]

{"sheet":"Wartungsplan","index":1,"n_rows":253,"n_cols":48,"rows_kept":253,"cut":false,"hidden":true,"merged":[]}
[]
[null,"Serviceplan Maxus"]
[]
["Sprache","Motor","Wartungsplan","T90 EV KM","T90 EV Jahre","T90 EV Zeit","T60 Max pre erste KM","T60 Max pre erste Jahre","T60 Max pre erste Zeit","T60 Max pre KM","T60 Max pre Jahre","T60 Max pre Zeit","T60 Max KM","T60 Max Jahre","T60 Max Zeit","eDeliver 5 KM","eDeliver 5 Jahre","eDeliver 5 Zeit","Deliver 7 KM","Deliver 7 Jahre","Deliver 7 Zeit","eTerron 9 KM","eTerron 9 Jahre","eTerron 9 Zeit","Mifa 7 KM","Mifa 7 Jahre","Mifa 7 Zeit","Mifa 9 KM","Mifa 9 Jahre","Mifa 9 Zeit","eDeliver 3 KM","eDeliver 3 Jahre","eDeliver 3 Zeit","eDeliver 7 KM","eDeliver 7 Jahre","eDeliver 7 Zeit","eDeliver 9 KM","eDeliver 9 Jahre","eDeliver 9 Zeit","Deliver 9 KM","Deliver 9 Jahre","Deliver 9 Zeit","Deliver 9 erste KM","Deliver 9 erste Jahre","Deliver 9 erste Zeit","EV80 KM","EV80 Jahre","EV80 Zeit"]
["D","E","Vorab Prüfung und Kampagnen","-","-","-","-","-","-","-","-","-","-","-","-","-","-","-","-","-","-","-","-","-","-","-","-","-","-","-","-","-","-","-","-","-","-","-","-","-","-","-","-","-","-","-","-","-"]
["D","E","Probefahrt",30000,2,"Standartwartung",null,null,null,null,null,null,null,null,null,30000,2,"Standartwartung",null,null,null,null,null,null,30000,2,"Standartwartung",30000,2,"Standartwartung",30000,2,"Standartwartung",30000,2,"Standartwartung",30000,2,"Standartwartung",null,null,null,null,null,null,15000,1,"Standartwartung"]
["D","E","Fahrzeug auf anstehende Kampagnen prüfen",30000,2,"Standartwartung",null,null,null,null,null,null,null,null,null,30000,2,"Standartwartung",null,null,null,null,null,null,30000,2,"Standartwartung",30000,2,"Standartwartung",30000,2,"Standartwartung",30000,2,"Standartwartung",30000,2,"Standartwartung",null,null,null,null,null,null,15000,1,"Standartwartung"]
["D","E","Fehlerspeicher Abfrage",30000,2,"Standartwartung",null,null,null,null,null,null,null,null,null,30000,2,"Standartwartung",null,null,null,null,null,null,30000,2,"Standartwartung",30000,2,"Standartwartung",30000,2,"Standartwartung",30000,2,"Standartwartung",30000,2,"Standartwartung",null,null,null,null,null,null,15000,1,"Standartwartung"]
["D","E","Am und im Fahrzeug","-","-","-","-","-","-","-","-","-","-","-","-","-","-","-","-","-","-","-","-","-","-","-","-","-","-","-","-","-","-","-","-","-","-","-","-","-","-","-","-","-","-","-","-","-"]
["D","E","Bremspedal schmieren",30000,2,"Standartwartung",null,null,null,null,null,null,null,null,null,30000,2,"Standartwartung",null,null,null,null,null,null,30000,2,"Standartwartung",30000,2,"Standartwartung",30000,2,"Standartwartung",30000,2,"Standartwartung",30000,2,"Standartwartung",null,null,null,null,null,null,15000,1,"Standartwartung"]
["D","E","Lenksäule und Lenkradaufhängung prüfen",30000,2,"Standartwartung",null,null,null,null,null,null,null,null,null,30000,2,"Standartwartung",null,null,null,null,null,null,30000,2,"Standartwartung",30000,2,"Standartwartung",30000,2,"Standartwartung",30000,2,"Standartwartung",30000,2,"Standartwartung",null,null,null,null,null,null,15000,1,"Standartwartung"]
["D","E","Reinigung und Schmierung von Scharnieren und Schlössern",30000,2,"Standartwartung",null,null,null,null,null,null,null,null,null,30000,2,"Standartwartung",null,null,null,null,null,null,30000,2,"Standartwartung",30000,2,"Standartwartung",30000,2,"Standartwartung",30000,2,"Standartwartung",30000,2,"Standartwartung",null,null,null,null,null,null,15000,1,"Standartwartung"]
["D","E","Kontrolle des Innenraumluftfilters, ersetzten wenn nötig",30000,2,0.2,null,null,null,null,null,null,null,null,null,30000,2,0.2,null,null,null,null,null,null,30000,2,0.2,30000,2,0.2,30000,2,0.2,30000,2,0.2,30000,2,0.2,null,null,null,null,null,null,15000,1,0.2]
["D","E","Kontrolle des Airbagsystems und korrekter Funktion der Gurte",30000,2,"Standartwartung",null,null,null,null,null,null,null,null,null,30000,2,"Standartwartung",null,null,null,null,null,null,30000,2,"Standartwartung",30000,2,"Standartwartung",30000,2,"Standartwartung",30000,2,"Standartwartung",30000,2,"Standartwartung",null,null,null,null,null,null,15000,1,"Standartwartung"]
["D","E","Kontrolle der Aussenbeleuchtung, Kombiinstrument und allen elektrischen Funktionen des Fahrzeugs",30000,2,"Standartwartung",null,null,null,null,null,null,null,null,null,30000,2,"Standartwartung",null,null,null,null,null,null,30000,2,"Standartwartung",30000,2,"Standartwartung",30000,2,"Standartwartung",30000,2,"Standartwartung",30000,2,"Standartwartung",null,null,null,null,null,null,15000,1,"Standartwartung"]
["D","E","Im Motorraum","-","-","-","-","-","-","-","-","-","-","-","-","-","-","-","-","-","-","-","-","-","-","-","-","-","-","-","-","-","-","-","-","-","-","-","-","-","-","-","-","-","-","-","-","-"]
["D","E","Kühlsystem auf Dichtheit prüfen und die Leitungen und Anschlüsse Sichtprüfen",30000,2,"Standartwartung",null,null,null,null,null,null,null,null,null,30000,2,"Standartwartung",null,null,null,null,null,null,30000,2,"Standartwartung",30000,2,"Standartwartung",30000,2,"Standartwartung",30000,2,"Standartwartung",30000,2,"Standartwartung",null,null,null,null,null,null,15000,1,"Standartwartung"]
["D","E","Kühlsystem inkl. Gefrierschutz prüfen",30000,2,"Standartwartung",null,null,null,null,null,null,null,null,null,30000,2,"Standartwartung",null,null,null,null,null,null,30000,2,"Standartwartung",30000,2,"Standartwartung",30000,2,"Standartwartung",30000,2,"Standartwartung",30000,2,"Standartwartung",null,null,null,null,null,null,15000,1,"Standartwartung"]
["D","E","Kontrolle des Ladezustandes der 12V Batterie, korrekte und saubere Montage der Polanschlüsse",30000,2,"Standartwartung",null,null,null,null,null,null,null,null,null,30000,2,"Standartwartung",null,null,null,null,null,null,30000,2,"Standartwartung",30000,2,"Standartwartung",30000,2,"Standartwartung",30000,2,"Standartwartung",30000,2,"Standartwartung",null,null,null,null,null,null,15000,1,"Standartwartung"]
["D","E","Sichtkontrolle des 12V Kabelstrangs und Stecker",30000,2,"Standartwartung",null,null,null,null,null,null,null,null,null,30000,2,"Standartwartung",null,null,null,null,null,null,30000,2,"Standartwartung",30000,2,"Standartwartung",30000,2,"Standartwartung",30000,2,"Standartwartung",30000,2,"Standartwartung",null,null,null,null,null,null,15000,1,"Standartwartung"]
["D","E","Kontrolle des Bremsflüssigkeitsstand, Nachfüllen wenn nötig",30000,2,"Standartwartung",null,null,null,null,null,null,null,null,null,30000,2,"Standartwartung",null,null,null,null,null,null,30000,2,"Standartwartung",30000,2,"Standartwartung",30000,2,"Standartwartung",30000,2,"Standartwartung",30000,2,"Standartwartung",null,null,null,null,null,null,15000,1,"Standartwartung"]
["D","E","Sicht- und Funktionskontrolle der Klimaanlage und aller Ihrer Bauteile",30000,2,"Standartwartung",null,null,null,null,null,null,null,null,null,30000,2,"Standartwartung",null,null,null,null,null,null,30000,2,"Standartwartung",30000,2,"Standartwartung",30000,2,"Standartwartung",30000,2,"Standartwartung",30000,2,"Standartwartung",null,null,null,null,null,null,15000,1,"Standartwartung"]
["D","E","Unterdrucksystem prüfen",30000,2,"Standartwartung",null,null,null,null,null,null,null,null,null,30000,2,"Standartwartung",null,null,null,null,null,null,30000,2,"Standartwartung",30000,2,"Standartwartung",30000,2,"Standartwartung",30000,2,"Standartwartung",30000,2,"Standartwartung",null,null,null,null,null,null,15000,1,"Standartwartung"]
["D","E","Unter dem Fahrzeug","-","-","-","-","-","-","-","-","-","-","-","-","-","-","-","-","-","-","-","-","-","-","-","-","-","-","-","-","-","-","-","-","-","-","-","-","-","-","-","-","-","-","-","-","-"]
["D","E","Inspektion des Chassis, Korrosionsschutz der Karosserie prüfen",30000,2,"Standartwartung",null,null,null,null,null,null,null,null,null,30000,2,"Standartwartung",null,null,null,null,null,null,30000,2,"Standartwartung",30000,2,"Standartwartung",30000,2,"Standartwartung",30000,2,"Standartwartung",30000,2,"Standartwartung",null,null,null,null,null,null,15000,1,"Standartwartung"]
["D","E","Kontrolle der Vorder- und Hinterradaufhängung",30000,2,"Standartwartung",null,null,null,null,null,null,null,null,null,30000,2,"Standartwartung",null,null,null,null,null,null,30000,2,"Standartwartung",30000,2,"Standartwartung",30000,2,"Standartwartung",30000,2,"Standartwartung",30000,2,"Standartwartung",null,null,null,null,null,null,15000,1,"Standartwartung"]
["D","E","Motorlager prüfen",30000,2,"Standartwartung",null,null,null,null,null,null,null,null,null,30000,2,"Standartwartung",null,null,null,null,null,null,30000,2,"Standartwartung",30000,2,"Standartwartung",30000,2,"Standartwartung",30000,2,"Standartwartung",30000,2,"Standartwartung",null,null,null,null,null,null,15000,1,"Standartwartung"]
["D","E","Kontrolle des Bremssystems auf Funktion inkl. Parkbremse",30000,2,"Standartwartung",null,null,null,null,null,null,null,null,null,30000,2,"Standartwartung",null,null,null,null,null,null,30000,2,"Standartwartung",30000,2,"Standartwartung",30000,2,"Standartwartung",30000,2,"Standartwartung",30000,2,"Standartwartung",null,null,null,null,null,null,15000,1,"Standartwartung"]
["D","E","Antriebswellen und Manschetten prüfen",30000,2,"Standartwartung",null,null,null,null,null,null,null,null,null,30000,2,"Standartwartung",null,null,null,null,null,null,30000,2,"Standartwartung",30000,2,"Standartwartung",30000,2,"Standartwartung",30000,2,"Standartwartung",30000,2,"Standartwartung",null,null,null,null,null,null,15000,1,"Standartwartung"]
["D","E","Kontrolle der Lenkung auf Spiel und ausreichendes Anzugsdrehmoment der Schrauben",30000,2,"Standartwartung",null,null,null,null,null,null,null,null,null,30000,2,"Standartwartung",null,null,null,null,null,null,30000,2,"Standartwartung",30000,2,"Standartwartung",30000,2,"Standartwartung",30000,2,"Standartwartung",30000,2,"Standartwartung",null,null,null,null,null,null,15000,1,"Standartwartung"]
{"$rows_left_out":224}
{"sheet":"Fahrzeugdaten","index":2,"n_rows":1115,"n_cols":12,"rows_kept":1115,"cut":false,"hidden":true,"merged":[]}
["VIN","Sharing-Marke","Familie","Modell","Ausführung","Ausführung-ID","Erstzulassungsdatum","Motor Nr.","Kraftstoff","Jahr","Modell Clean","Produktionsdatum"]
["LSH14J4C1PA100728","Maxus_CH","(e)Deliver 9","eDeliver 9 VAN L3H2","72kWh","a0pQC00000DMtZe","31.12.2024","919181P00034P5170298","Electric",{"$f":"IF(report1737987713132[[#This Row],[Erstzulassungsdatum]]=\"\",\"\",YEAR(report1737987713132[[#This Row],[Erstzulassungsdatum]]))","v":2024},"eDeliver 9",""]
["LSH14J7C5PA107922","Maxus_CH","(e)Deliver 9","Deliver 9 VAN L3H2 FWD","Luxury","a0pQC00000DMlx3","31.10.2024","M923A089734","Diesel",{"$f":"IF(report1737987713132[[#This Row],[Erstzulassungsdatum]]=\"\",\"\",YEAR(report1737987713132[[#This Row],[Erstzulassungsdatum]]))","v":2024},"Deliver 9",""]
["LSH14C4C0MA122677","Maxus_CH","EV30 PV","OLDEV30 PV","VEV3P","a0pQC00000DhecN","31.08.2022","918674P00044MA096118","",{"$f":"IF(report1737987713132[[#This Row],[Erstzulassungsdatum]]=\"\",\"\",YEAR(report1737987713132[[#This Row],[Erstzulassungsdatum]]))","v":2022},"eDeliver 3",""]
["LSH15J5C1SV120930","Maxus_CH","(e)Deliver 7","eDeliver 7 VAN L2H1 AWD","88kWh Dual Sliding Door Swiss Post Los 49 #1","a0pQC00000HhTgA","31.07.2025","918787P06014R8250003","Electric",{"$f":"IF(report1737987713132[[#This Row],[Erstzulassungsdatum]]=\"\",\"\",YEAR(report1737987713132[[#This Row],[Erstzulassungsdatum]]))","v":2025},"eDeliver 7",""]
["LSH15J5C2SV120919","Maxus_CH","(e)Deliver 7","eDeliver 7 VAN L2H1 AWD","88kWh Dual Sliding Door Swiss Post Los 49 #1","a0pQC00000HhTgA","31.07.2025","918787P06014RA230011","Electric",{"$f":"IF(report1737987713132[[#This Row],[Erstzulassungsdatum]]=\"\",\"\",YEAR(report1737987713132[[#This Row],[Erstzulassungsdatum]]))","v":2025},"eDeliver 7",""]
["LSH14J4C3SV121520","Maxus_CH","(e)Deliver 7","eDeliver 7 VAN L1H1 FWD","88kWh","a0pQC00000HQjcY","31.07.2025","914712P03299RB050020","Electric",{"$f":"IF(report1737987713132[[#This Row],[Erstzulassungsdatum]]=\"\",\"\",YEAR(report1737987713132[[#This Row],[Erstzulassungsdatum]]))","v":2025},"eDeliver 7",""]
["LSFAM11C1SA082057","Maxus_CH","T60 MAX","T60 MAX","AWD","a0pQC00000FBTso","31.07.2025","M9253017485","Diesel",{"$f":"IF(report1737987713132[[#This Row],[Erstzulassungsdatum]]=\"\",\"\",YEAR(report1737987713132[[#This Row],[Erstzulassungsdatum]]))","v":2025},"T60 Max","2025-02-28"]
["LSFAM1209PA067091","Maxus_CH","T90 EV","T90 EV Pick Up RWD","89kWh","a0pQC00000DMoF4","31.07.2023","917939P04016NA130062","Electric",{"$f":"IF(report1737987713132[[#This Row],[Erstzulassungsdatum]]=\"\",\"\",YEAR(report1737987713132[[#This Row],[Erstzulassungsdatum]]))","v":2023},"T90 EV",""]
["LSH14C4C1LA079997","Maxus_CH","EV30 PV","OLDEV30 PV","VEV3P","a0pQC00000DhecN","31.05.2021","912832P00044L5246012","",{"$f":"IF(report1737987713132[[#This Row],[Erstzulassungsdatum]]=\"\",\"\",YEAR(report1737987713132[[#This Row],[Erstzulassungsdatum]]))","v":2021},"eDeliver 3",""]
["LSH14C4C9LA080055","Maxus_CH","EV30 PV","OLDEV30 PV","VEV3P","a0pQC00000DhecN","31.05.2021","912832P00044L5246066","",{"$f":"IF(report1737987713132[[#This Row],[Erstzulassungsdatum]]=\"\",\"\",YEAR(report1737987713132[[#This Row],[Erstzulassungsdatum]]))","v":2021},"eDeliver 3",""]
["LSH14J7C6RV125504","Maxus_CH","(e)Deliver 7","Deliver 7 VAN L2H1 FWD","-","a0pQC00000DMxYG","31.03.2025","M924A059748","Diesel",{"$f":"IF(report1737987713132[[#This Row],[Erstzulassungsdatum]]=\"\",\"\",YEAR(report1737987713132[[#This Row],[Erstzulassungsdatum]]))","v":2025},"Deliver 7",""]
["LSH14J7C1RV125488","Maxus_CH","(e)Deliver 7","Deliver 7 VAN L2H1 FWD","Dual Sliding Door","a0pQC00000DMxYH","31.03.2025","M9249059187","Diesel",{"$f":"IF(report1737987713132[[#This Row],[Erstzulassungsdatum]]=\"\",\"\",YEAR(report1737987713132[[#This Row],[Erstzulassungsdatum]]))","v":2025},"Deliver 7",""]
["LSFAM11C9RA134545","Maxus_CH","T60 MAX","T60 MAX","AWD","a0pQC00000FBTso","31.03.2025","M924A064113","Diesel",{"$f":"IF(report1737987713132[[#This Row],[Erstzulassungsdatum]]=\"\",\"\",YEAR(report1737987713132[[#This Row],[Erstzulassungsdatum]]))","v":2025},"T60 Max","2024-09-30"]
["LSFAL1103KA102947","Maxus_CH","EV80 CC","OLDEV80 CC","VE8C","a0pQC00000DhUIg","31.03.2022","105855P01109KB190010","",{"$f":"IF(report1737987713132[[#This Row],[Erstzulassungsdatum]]=\"\",\"\",YEAR(report1737987713132[[#This Row],[Erstzulassungsdatum]]))","v":2022},"EV 80",""]
["LSH14C4C5NA137175","Maxus_CH","eDeliver 3","eDeliver 3 VAN L2H1 FWD","50kWh","a0pQC00000DMpio","31.01.2024","910851P00044N7266006","Electric",{"$f":"IF(report1737987713132[[#This Row],[Erstzulassungsdatum]]=\"\",\"\",YEAR(report1737987713132[[#This Row],[Erstzulassungsdatum]]))","v":2024},"eDeliver 3",""]
["LSH14J7C5PA108889","Maxus_CH","(e)Deliver 9","Deliver 9 VAN L3H2 FWD","Luxury","a0pQC00000DMlx3","30.12.2024","M923A089730","Diesel",{"$f":"IF(report1737987713132[[#This Row],[Erstzulassungsdatum]]=\"\",\"\",YEAR(report1737987713132[[#This Row],[Erstzulassungsdatum]]))","v":2024},"Deliver 9",""]
["LSH14J4C3NA057250","Maxus_CH","(e)Deliver 9","eDeliver 9 VAN L3H3","FWD 72kWh","a0pQC00000DN1K5","30.11.2023","914600P00034N8100037","Electric",{"$f":"IF(report1737987713132[[#This Row],[Erstzulassungsdatum]]=\"\",\"\",YEAR(report1737987713132[[#This Row],[Erstzulassungsdatum]]))","v":2023},"eDeliver 9",""]
["LSH14J4C6NA057257","Maxus_CH","(e)Deliver 9","eDeliver 9 VAN L3H3","FWD 72kWh","a0pQC00000DN1K5","30.11.2023","914600P00034N8150043","Electric",{"$f":"IF(report1737987713132[[#This Row],[Erstzulassungsdatum]]=\"\",\"\",YEAR(report1737987713132[[#This Row],[Erstzulassungsdatum]]))","v":2023},"eDeliver 9",""]
["LSH14J4C7NA057252","Maxus_CH","(e)Deliver 9","eDeliver 9 VAN L3H3","FWD 72kWh","a0pQC00000DN1K5","30.11.2023","914600P00034N8140477","Electric",{"$f":"IF(report1737987713132[[#This Row],[Erstzulassungsdatum]]=\"\",\"\",YEAR(report1737987713132[[#This Row],[Erstzulassungsdatum]]))","v":2023},"eDeliver 9",""]
["LSH14C4CXMA122704","Maxus_CH","EV30 PV","OLDEV30 PV","VEV3P","a0pQC00000DhecN","30.11.2023","918674P00044M8106077","",{"$f":"IF(report1737987713132[[#This Row],[Erstzulassungsdatum]]=\"\",\"\",YEAR(report1737987713132[[#This Row],[Erstzulassungsdatum]]))","v":2023},"eDeliver 3",""]
["LSH14J7C1PA108985","Maxus_CH","(e)Deliver 9","Deliver 9 VAN L3H2 FWD","Comfort","a0pQC00000DMlx4","30.10.2024","M923B097710","Diesel",{"$f":"IF(report1737987713132[[#This Row],[Erstzulassungsdatum]]=\"\",\"\",YEAR(report1737987713132[[#This Row],[Erstzulassungsdatum]]))","v":2024},"Deliver 9",""]
["LSFAL1104KA102942","Maxus_CH","EV80 CC","OLDEV80 CC","VE8C","a0pQC00000DhUIg","30.10.2020","105855P01109KB280006","",{"$f":"IF(report1737987713132[[#This Row],[Erstzulassungsdatum]]=\"\",\"\",YEAR(report1737987713132[[#This Row],[Erstzulassungsdatum]]))","v":2020},"EV 80",""]
["LSH14J7C8SV122643","Maxus_CH","(e)Deliver 7","Deliver 7 VAN L2H1 FWD","Dual Sliding Door","a0pQC00000DMxYH","30.09.2025","M9256035442","Diesel",{"$f":"IF(report1737987713132[[#This Row],[Erstzulassungsdatum]]=\"\",\"\",YEAR(report1737987713132[[#This Row],[Erstzulassungsdatum]]))","v":2025},"Deliver 7",""]
["LSH15J5C0SV122085","Maxus_CH","(e)Deliver 7","eDeliver 7 VAN L1H1 AWD","88kWh Dual Sliding Door Luxury","a0pQC00000IdnUl","30.09.2025","","Electric",{"$f":"IF(report1737987713132[[#This Row],[Erstzulassungsdatum]]=\"\",\"\",YEAR(report1737987713132[[#This Row],[Erstzulassungsdatum]]))","v":2025},"eDeliver 7",""]
["LSH14J4C1RV121851","Maxus_CH","(e)Deliver 7","eDeliver 7 VAN L2H1 FWD","88kWh","a0pQC00000DMo24","30.09.2025","917164P03299PC090198","Electric",{"$f":"IF(report1737987713132[[#This Row],[Erstzulassungsdatum]]=\"\",\"\",YEAR(report1737987713132[[#This Row],[Erstzulassungsdatum]]))","v":2025},"eDeliver 7",""]
["LSH14J4C5PA086087","Maxus_CH","(e)Deliver 9","eDeliver 9 VAN L2H2","FWD 52kWh Pack Plus","a0pQC00000DMtxj","30.09.2024","914600P00034NC290132","Electric",{"$f":"IF(report1737987713132[[#This Row],[Erstzulassungsdatum]]=\"\",\"\",YEAR(report1737987713132[[#This Row],[Erstzulassungsdatum]]))","v":2024},"eDeliver 9",""]
["LSH14J4C7PA100992","Maxus_CH","(e)Deliver 9","eDeliver 9 VAN L2H2","72kWh Plus Pack","a0pQC00000DMtxl","30.09.2024","919181P00034P6260155","Electric",{"$f":"IF(report1737987713132[[#This Row],[Erstzulassungsdatum]]=\"\",\"\",YEAR(report1737987713132[[#This Row],[Erstzulassungsdatum]]))","v":2024},"eDeliver 9",""]
["LSH14J4C5NA057539","Maxus_CH","(e)Deliver 9","eDeliver 9 VAN L3H2","FWD 72kWh","a0pQC00000DMtZb","30.09.2022","917785P00034MB300109","Electric",{"$f":"IF(report1737987713132[[#This Row],[Erstzulassungsdatum]]=\"\",\"\",YEAR(report1737987713132[[#This Row],[Erstzulassungsdatum]]))","v":2022},"eDeliver 9",""]
["LSH14J4C3LA050375","Maxus_CH","EV80 PV","OLDEV80 PV","VE8P","a0pQC00000DhYVe","30.09.2021","104125P01109L3130017","",{"$f":"IF(report1737987713132[[#This Row],[Erstzulassungsdatum]]=\"\",\"\",YEAR(report1737987713132[[#This Row],[Erstzulassungsdatum]]))","v":2021},"EV 80",""]
{"$rows_left_out":1086}
{"sheet":"Servicezeiten","index":3,"n_rows":22,"n_cols":17,"rows_kept":22,"cut":false,"hidden":true,"merged":[]}
["Modell",1,2,3,4,5,null,null,null,null,null,null,null,null,null,null,"Jahr"]
["eDeliver 3",1,1.2,1,1.2,1,null,null,null,null,null,null,null,null,null,null,2015]
["eDeliver 9",0.5,1,1.2,1,1.2,null,null,null,null,null,null,null,null,null,null,2016]
["Deliver 9",1.5,1.4,2,1.4,2,null,null,null,null,null,null,null,null,null,null,2017]
["EV80",0.5,1,1.5,1,1.5,null,null,null,null,null,null,null,null,null,null,2018]
["eDeliver 7",0.5,1,1.2,1,1.2,null,null,null,null,null,null,null,null,null,null,2019]
["Mifa 9",0.5,1,1.2,1,1.2,null,null,null,null,null,null,null,null,null,null,2020]
["eTerron 9",0.5,1,1.2,1,1.2,null,null,null,null,null,null,null,null,null,null,2021]
["Mifa 7",0.5,1,1.2,1,1.2,null,null,null,null,null,null,null,null,null,null,2022]
["eDeliver 5",0.5,1,1.2,1,1.2,null,null,null,null,null,null,null,null,null,null,2023]
["T60 Max",1.5,1.4,2,1.4,2,null,null,null,null,null,null,null,null,null,null,2024]
["Deliver 7",1.5,1.4,2,1.4,2,null,null,null,null,null,null,null,null,null,null,2025]
["T90 EV",0.5,1,1.2,1,1.2,null,null,null,null,null,null,null,null,null,null,2026]
[null,null,null,null,null,null,null,null,null,null,null,null,null,null,null,null,2027]
[null,null,null,null,null,null,null,null,null,null,null,null,null,null,null,null,2028]
[null,null,null,null,null,null,null,null,null,null,null,null,null,null,null,null,2029]
[null,null,null,null,null,null,null,null,null,null,null,null,null,null,null,null,2030]
[null,null,null,null,null,null,null,null,null,null,null,null,null,null,null,null,2031]
[null,null,null,null,null,null,null,null,null,null,null,null,null,null,null,null,2032]
[null,null,null,null,null,null,null,null,null,null,null,null,null,null,null,null,2033]
[null,null,null,null,null,null,null,null,null,null,null,null,null,null,null,null,2034]
[null,null,null,null,null,null,null,null,null,null,null,null,null,null,null,null,2035]

{"sheet":"VIN Table","index":4,"n_rows":28,"n_cols":12,"rows_kept":28,"cut":false,"hidden":true,"merged":[]}
[null,"eD5","eT9","T60","D7","eD7","eD3","M9","M7","D9","eD9","T90"]
[1,"L","L","L","L","L","L","L","L","L","L","L"]
[2,"S","S","S","S","S","S","S","S","S","S","S"]
[3,"H","F","F","H","H","F","K","K","H","H","F"]
[4,1,"A","A",1,1,null,"G","G",1,1,"A"]
[5,4,"M","M","M","M","M",4,4,4,4,"L"]
[6,"J",1,1,"J","J",1,8,8,"J","J",1]
[7,4,1,1,7,4,1,"C","C",7,4,1]
[8,"C",0,null,"C","C",0,1,1,null,null,0]
[9]
[10,"N","N","N","P","N","N","N","N","N","N","N"]
[11,"D","A","A","V","V",null,"D","D","A","A","A"]
[12]
[13]
[14]
[15]
[16]
[17]
[]
[null,null,null,"Identifier"]
[]
[null,null,null,null,null,null,null,"8 = EV"]
[null,"4= BEV","1 Front Engine; 2 Rear Engine","1 Front Engine; 2 Rear Engine",null,null,"1 Front Engine; 2 Rear Engine","C = LHD"]
[null,"Brake System","0= EV; C= Diesel; J= Benzin","A: -120kW Diesel; B: - 160kW Diesel; C: -200kW Diesel; 0: EW","Brake System","Brake System","0= EV","Engine Posi",null,null,null,"0= EV"]
[null,null,null,"Verfification Number"]
[null,null,null,"N= 2022; P= 2023…..."]
[null,null,null,"Plant",null,null,"E oder A oder D"]
[null,null,null,"Serieal No"]